*HEADING
**--------------------------------------------------------------------**
**--------------------------------------------------------------------**
**Parameters
*PARAMETER
**--------------------------------------**
  Xl0     =  1.0
  Rate    =  0.1
  Strain  =  0.5
  Period  =  abs(Strain/Rate)
  Disp    =  Xl0*exp(Rate*Period)-Xl0
**--------------------------------------**
**  Period  =  log((Disp+Xl0)/Xl0)/Rate
**--------------------------------------**
  InitDt        = Period/1000.
  MaxDt         = Period/1000.
**--------------------------------------**
** Material Parameters for UMAT DMG Model (umat_dmg-55p.f)
**----------  Material Parameters
  G         = 17000.
  a         = 6.160e+05
  K         = 50000.
  b         = 5.86
  Tmelt     = 435.
**----------  BCJ Parameters
  C01       = 0.
  C02       = 0.
  C03       = 92.82
  C04       = 47.93
  C05       = 1.000e-05
  C06       = 5.991e-07
  C07       = 14.8
  C08       = 6.911e-07
  C09       = 4.077e+04
  C10       = 102.4
  C11       = 0.
  C12       = 0.
  C13       = 1.929e+07
  C14       = 6.868e+03
  C15       = 1.577e+03
  C16       = 5.931e-01
  C17       = 6.529e-05
  C18       = 1.064e+06
  C19       = 0.
  C20       = 0.
  Ca        = 1.883
  Cb        = 8.272e-03
**----------  Temperature Parameters
  InitTemp  = 293.
  HeatGen   = 0.
**----------  Microstructure Parameters
  VoidGrthn = 0.01
  InitVRad  = 0.0000e-4
  TorsCsta  = 1.
  NuclCsta  = 1.
  NuclCstc  = 1.
  NuclCoef  = 0.
  KIc       = 17.3
  PartSize  = 4.000e-04
  PartVF    = 0.07
  cd1       = 5.5
  cd2       = 5.
**----------  Grain Size Parameters
  Dcs0      = 20.
  Dcs       = 20.
  zz        = 0.0509
  InitVVF   = 0.01
**----------  Other BCJ Parameters
  C21       = 0.
  C22       = 0.
  C23       = 0.
  C24       = 0.
  C25       = 0.
  C26       = 0.
**----------  Temperature Parameters for Nucleation and Coalescence
  Tnucl     = 0.
  Tcoal     = 0.
**----------  Flag, Cacon and Elastic Modulus porosity exponent
  Flag      = 0.
  Cacon     = 0.
  Zeta      = 0.
**
** END PARAMETERS
**---------------------------------------------------------------**
**---------------------------------------------------------------**
**---------------------------------------------------------------**
*NODE
2, <Xl0>,    0.,    0.
3, <Xl0>, <Xl0>,    0.
4,    0., <Xl0>,    0.
5,    0.,    0., <Xl0>
6, <Xl0>,    0., <Xl0>
7, <Xl0>, <Xl0>, <Xl0>
8,    0., <Xl0>, <Xl0>
*NSET,NSET=FACE1
*NSET,NSET=FACE2
*NSET,NSET=FACE3
*NSET,NSET=FACE4
*NSET,NSET=FACE5
*NSET,NSET=FACE6
*ELEMENT,TYPE=C3D8,ELSET=EVR
**-------------------------------------------------------------**
**-------------------------------------------------------------**
*SOLID SECTION,ELSET=EVR,MATERIAL=METAL
**HOURGLASS STIFFNESS
**49.248
**-------------------------------------------------------------**
*MATERIAL,NAME=METAL
*DENSITY
 7.850E-09
*USER MATERIAL,CONSTANTS=55
**---------------------------------------------------------------------------------------------------**
**---------------------------------------------------------------------------------------------------**
        <G>,         <a>,         <K>,         <b>,     <Tmelt>,       <C01>,      <C02>,       <C03>,
      <C04>,       <C05>,       <C06>,       <C07>,       <C08>,       <C09>,      <C10>,       <C11>,
      <C12>,       <C13>,       <C14>,       <C15>,       <C16>,       <C17>,      <C18>,       <C19>,
      <C20>,        <Ca>,        <Cb>,  <InitTemp>,   <HeatGen>, <VoidGrthn>, <InitVRad>,  <TorsCsta>,
 <NuclCsta>,  <NuclCstc>,  <NuclCoef>,       <KIc>,  <PartSize>,    <PartVF>,      <cd1>,       <cd2>,
     <Dcs0>,       <Dcs>,        <zz>,   <InitVVF>,       <C21>,       <C22>,      <C23>,       <C24>,
      <C25>,       <C26>,     <Tnucl>,     <Tcoal>,      <Flag>,     <Cacon>,     <Zeta>
**---------------------------------------------------------------------------------------------------**
*DEPVAR
**---------------------------------------------------------------------------------------------------**
**---------------------------------------------------------------------------------------------------**
**-------------------------------**
*STEP,INC=5000,NLGEOM=YES,UNSYMM=YES
*STATIC
<InitDt>,<Period>,,<MaxDt>
**-------------------------------**
**--------    TENSION    --------**
**-------------------------------**
*BOUNDARY
FACE6,1
FACE3,2
FACE1,3
*BOUNDARY,USER
FACE4,1,1,
**BOUNDARY
**FACE4,1,1,<Displacement>
*MONITOR,DOF=1,NODE=2
**-------------------------------**
**----------    SHEAR    --------**
**-------------------------------**
**BOUNDARY
**FACE1,1,3,
**FACE2,2,3,
**BOUNDARY
**FACE2,1,1,1.0
**MONITOR,DOF=1,NODE=5
**-------------------------------**
**-------------------------------**
*OUTPUT,FIELD,FREQUENCY=1
*NODE OUTPUT
U,RF
*ELEMENT OUTPUT
S,SINV,SDV,E
*ENERGY PRINT,FREQUENCY=1
*ENDSTEP
**--------------------------------------------------------------------**
**--------------------------------------------------------------------**